Reaction Details
TargetCarboxypeptidase B2
LigandBDBM47512
Substrate/Competitorn/a
Meas. Tech.Inhibition Assay
Ki 5.0e+4±n/a nM
Citation Fernández, DAvilés, FXVendrell, J Aromatic organic compounds as scaffolds for metallocarboxypeptidase inhibitor design. Chem Biol Drug Des73:75-82 (2009) 
 
Carboxypeptidase B2
Name:Carboxypeptidase B2
Type:Enzyme
Mol. Mass.:48432.74
Organism:Homo sapiens (Human)
Description:Q96IY4
Residue:423
BDBM47512
NameBDBM47512
Synonyms:1-(4-methylphenyl)-2-[[5-(8-quinolinyloxymethyl)-1,3,4-oxadiazol-2-yl]thio]ethanone 1-(p-tolyl)-2-[[5-(8-quinolyloxymethyl)-1,3,4-oxadiazol-2-yl]thio]ethanone MLS000071760 cid_650551
TypeSmall organic molecule
Emp. Form.C21H17N3O3S
Mol. Mass.391.443
SMILESCc1ccc(cc1)C(=O)CSc1nnc(COc2cccc3cccnc23)o1