Reaction Details
TargetCarboxypeptidase B2
LigandBDBM81909
Substrate/Competitorn/a
Meas. Tech.Inhibition Assay
Ki 1.43e+4±n/a nM
Citation Fernández, DAvilés, FXVendrell, J Aromatic organic compounds as scaffolds for metallocarboxypeptidase inhibitor design. Chem Biol Drug Des73:75-82 (2009) 
 
Carboxypeptidase B2
Name:Carboxypeptidase B2
Type:Enzyme
Mol. Mass.:48432.74
Organism:Homo sapiens (Human)
Description:Q96IY4
Residue:423
BDBM81909
NameBDBM81909
Synonyms:N-benzyl-4-fluoro-N-((4-hydroxyquinazolin-2-yl)methylbenzensulfonamide, 9
TypeSmall organic molecule
Emp. Form.C22H18FN3O3S
Mol. Mass.423.46
SMILESFc1ccc(cc1)S(=O)(=O)N(Cc1ccccc1)Cc1nc2ccccc2c(=O)[nH]1