Reaction Details
TargetCarboxypeptidase B
LigandBDBM81903
Substrate/Competitorn/a
Meas. Tech.Inhibition Assay
Ki 1.29e+5±n/a nM
Citation Fernández, DAvilés, FXVendrell, J Aromatic organic compounds as scaffolds for metallocarboxypeptidase inhibitor design. Chem Biol Drug Des73:75-82 (2009) 
 
Carboxypeptidase B
Name:Carboxypeptidase B
Synonyms:CPB
Type:Enzyme
Mol. Mass.:48382.46
Organism:Helicoverpa zea (Corn earworm moth) (Heliothis zea)
Description:Q3T905
Residue:429
BDBM81903
NameBDBM81903
Synonyms:2-amino-3-(1-aminoisoquinolin-7-yl)propanoic acid, 2
TypeSmall organic molecule
Emp. Form.C12H13N3O2
Mol. Mass.231.2505
SMILESNC(Cc1ccc2ccnc(N)c2c1)C(O)=O