Reaction Details
TargetCarboxypeptidase B
LigandBDBM81907
Substrate/Competitorn/a
Meas. Tech.Inhibition Assay
Ki 2.05e+4±n/a nM
Citation Fernández, DAvilés, FXVendrell, J Aromatic organic compounds as scaffolds for metallocarboxypeptidase inhibitor design. Chem Biol Drug Des73:75-82 (2009) 
 
Carboxypeptidase B
Name:Carboxypeptidase B
Synonyms:CPB
Type:Enzyme
Mol. Mass.:48382.46
Organism:Helicoverpa zea (Corn earworm moth) (Heliothis zea)
Description:Q3T905
Residue:429
BDBM81907
NameBDBM81907
Synonyms:1-(2-hydroxyethyl)-1-((6-methoxy-2-oxo-1,2-dihydroquinolin-3-yl)methyl)3-yl)methyl)-3-p-tolythiourea, 7
TypeSmall organic molecule
Emp. Form.C21H23N3O3S
Mol. Mass.397.491
SMILESCOc1ccc2[nH]c(=O)c(CN(CCO)C(=S)Nc3ccc(C)cc3)cc2c1