Reaction Details
TargetHeat shock protein HSP 90-alpha
LigandBDBM81913
Substrate/Competitorn/a
Meas. Tech.Competition Assay
pH7.4±0
IC50 0.5±0.0 nM
Citation Feldman, RIMintzer, BZhu, DWu, JMBiroc, SLYuan, SEmayan, KChang, ZChen, DArnaiz, DOBryant, JGe, XSWhitlow, MAdler, MPolokoff, MALi, WWFerrer, MSato, TGu, JMShen, JTseng, JLDinter, HBuckman, B Potent triazolothione inhibitor of heat-shock protein-90. Chem Biol Drug Des74:43-50 (2009) 
 
Heat shock protein HSP 90-alpha
Name:Heat shock protein HSP 90-alpha
Type:Molecular Chaperone
Mol. Mass.:84623.45
Organism:Homo sapiens (Human)
Description:P07900
Residue:732
BDBM81913
NameBDBM81913
Synonyms:Unsubstituted phenyl ring analog, 2
TypeSmall organic molecule
Emp. Form.C14H11N3O2S
Mol. Mass.285.321
SMILESOc1ccc(-c2n[nH]c(=S)n2-c2ccccc2)c(O)c1