Reaction Details
TargetHeat shock protein HSP 90-alpha
LigandBDBM81915
Substrate/Competitorn/a
Meas. Tech.Competition Assay
pH7.4±0
IC50 0.2±0.0 nM
Citation Feldman, RIMintzer, BZhu, DWu, JMBiroc, SLYuan, SEmayan, KChang, ZChen, DArnaiz, DOBryant, JGe, XSWhitlow, MAdler, MPolokoff, MALi, WWFerrer, MSato, TGu, JMShen, JTseng, JLDinter, HBuckman, B Potent triazolothione inhibitor of heat-shock protein-90. Chem Biol Drug Des74:43-50 (2009) 
 
Heat shock protein HSP 90-alpha
Name:Heat shock protein HSP 90-alpha
Type:Molecular Chaperone
Mol. Mass.:84623.45
Organism:Homo sapiens (Human)
Description:P07900
Residue:732
BDBM81915
NameBDBM81915
Synonyms:Ethyl analog, 4
TypeSmall organic molecule
Emp. Form.C20H17N3O2S
Mol. Mass.363.433
SMILESCCc1cc(-c2n[nH]c(=S)n2-c2cccc3ccccc23)c(O)cc1O