Reaction Details
TargetCarbonic anhydrase 2
LigandBDBM33266
Substrate/Competitorn/a
Meas. Tech.Inhibition Assay
pH7.4±0
Temperature298.15±0 K
Ki 665±0.0 nM
Citation Carta, FPothen, BMaresca, ATiwari, MSingh, VSupuran, CT Carbonic anhydrase inhibitors: inhibition of cytosolic carbonic anhydrase isozymes II and VII with simple aromatic sulfonamides and some azo dyes. Chem Biol Drug Des74:196-202 (2009) 
 
Carbonic anhydrase 2
Name:Carbonic anhydrase 2
Type:Enzyme
Mol. Mass.:29250.71
Organism:Homo sapiens (Human)
Description:P00918
Residue:260
BDBM33266
NameBDBM33266
Synonyms:CHEMBL379206 p-Phenyldiazenyl derivative, 5
TypeSmall organic molecule
Emp. Form.C12H11N3O3S
Mol. Mass.277.299
SMILESNS(=O)(=O)c1ccc(cc1)N=Nc1ccc(O)cc1