Reaction Details
TargetCarbonic anhydrase 2
LigandBDBM81922
Substrate/Competitorn/a
Meas. Tech.Inhibition Assay
pH7.4±0
Temperature298.15±0 K
Ki 312±0.0 nM
Citation Carta, FPothen, BMaresca, ATiwari, MSingh, VSupuran, CT Carbonic anhydrase inhibitors: inhibition of cytosolic carbonic anhydrase isozymes II and VII with simple aromatic sulfonamides and some azo dyes. Chem Biol Drug Des74:196-202 (2009) 
 
Carbonic anhydrase 2
Name:Carbonic anhydrase 2
Type:Enzyme
Mol. Mass.:29250.71
Organism:Homo sapiens (Human)
Description:P00918
Residue:260
BDBM81922
NameBDBM81922
Synonyms:p-Phenyldiazenyl derivative, 7
TypeSmall organic molecule
Emp. Form.C14H15N3O3S
Mol. Mass.305.352
SMILESCN(C)S(=O)(=O)c1ccc(cc1)N=Nc1ccc(O)cc1