Reaction Details
TargetCarbonic anhydrase 7
LigandBDBM50025093
Substrate/Competitorn/a
Meas. Tech.Inhibition Assay
pH7.4±0
Temperature298.15±0 K
Ki 53±0.0 nM
Citation Carta, FPothen, BMaresca, ATiwari, MSingh, VSupuran, CT Carbonic anhydrase inhibitors: inhibition of cytosolic carbonic anhydrase isozymes II and VII with simple aromatic sulfonamides and some azo dyes. Chem Biol Drug Des74:196-202 (2009) 
 
Carbonic anhydrase 7
Name:Carbonic anhydrase 7
Type:Enzyme
Mol. Mass.:29664.11
Organism:Homo sapiens (Human)
Description:Human cloned isozyme.
Residue:264
BDBM50025093
NameBDBM50025093
Synonyms:4-Chloro-benzenesulfonamide P-Chlorobenzenesulfonamide | p-Halide-sulfanilamide derivative, 2
TypeSmall organic molecule
Emp. Form.C6H6ClNO2S
Mol. Mass.191.635
SMILESNS(=O)(=O)c1ccc(Cl)cc1