Reaction Details
TargetMuscarinic acetylcholine receptor M2
LigandBDBM50018056
Substrate/Competitorn/a
Ki 230±n/a nM
CommentsPDSP_246
Citation Smith, TDAnnis, SJEhlert, FJLeslie, FM N-[3H]methylscopolamine labeling of non-M1, non-M2 muscarinic receptor binding sites in rat brain. J Pharmacol Exp Ther256:1173-81 (1991) Muscarinic acetylcholine receptor M2
Name:Muscarinic acetylcholine receptor M2
Type:Enzyme Catalytic Domain
Mol. Mass.:51555.53
Organism:RAT
Description:P10980
Residue:466
BDBM50018056
NameBDBM50018056
Synonyms:(AF-DX 116) 11-[2-(2-Diethylaminomethyl-piperidin-1-yl)-acetyl]-5,11-dihydro-benzo[e]pyrido[3,2-b][1,4]diazepin-6-one 2-Diethylaminomethyl-1-[2-oxo-2-(6-oxo-5,6-dihydro-benzo[e]pyrido[3,2-b][1,4]diazepin-11-yl)-ethyl]-piperidinium AF-DX 116 CHEMBL17045 | Otenzepad
TypeSmall organic molecule
Emp. Form.C24H31N5O2
Mol. Mass.421.5352
SMILESCCN(CC)CC1CCCCN1CC(=O)N1c2ccccc2C(=O)Nc2cccnc12