Reaction Details
TargetMuscarinic acetylcholine receptor M2
LigandBDBM81799
Substrate/Competitorn/a
Ki 49.1±n/a nM
CommentsPDSP_932
Citation Smith, TDAnnis, SJEhlert, FJLeslie, FM N-[3H]methylscopolamine labeling of non-M1, non-M2 muscarinic receptor binding sites in rat brain. J Pharmacol Exp Ther256:1173-81 (1991) Muscarinic acetylcholine receptor M2
Name:Muscarinic acetylcholine receptor M2
Type:Enzyme Catalytic Domain
Mol. Mass.:51555.53
Organism:RAT
Description:P10980
Residue:466
BDBM81799
NameBDBM81799
Synonyms:CAS_98299-40-2 NSC_3602 | hexahydrosiladifenidol
TypeSmall organic molecule
Emp. Form.C20H33NOSi
Mol. Mass.331.5676
SMILESO[Si](CCCN1CCCCC1)(C1CCCCC1)c1ccccc1