Reaction Details
TargetD(2) dopamine receptor
LigandBDBM21397
Substrate/Competitorn/a
Ki 0.01±n/a nM
CommentsPDSP_1739
Citation Neve, KA Regulation of dopamine D2 receptors by sodium and pH. Mol Pharmacol39:570-8 (1991) D(2) dopamine receptor
Name:D(2) dopamine receptor
Type:Enzyme
Mol. Mass.:50957.64
Organism:Mus musculus (Mouse)
Description:P61168
Residue:444
BDBM21397
NameBDBM21397
Synonyms:8-[4-(4-fluorophenyl)-4-keto-butyl]-1-phenyl-1,3,8-triazaspiro[4.5]decan-4-one 8-[4-(4-fluorophenyl)-4-oxobutyl]-1-phenyl-1,3,8-triazaspiro[4.5]decan-4-one MLS000028615 SPIPERONE US9359372, Spiperone cid_5265
Typeradiolabeled ligand
Emp. Form.C23H26FN3O2
Mol. Mass.395.4698
SMILESFc1ccc(cc1)C(=O)CCCN1CCC2(CC1)N(CNC2=O)c1ccccc1