Reaction Details
TargetD(2) dopamine receptor
LigandBDBM11638
Substrate/Competitorn/a
Ki 14.45±n/a nM
CommentsPDSP_1779
Citation Neve, KA Regulation of dopamine D2 receptors by sodium and pH. Mol Pharmacol39:570-8 (1991) D(2) dopamine receptor
Name:D(2) dopamine receptor
Type:Enzyme
Mol. Mass.:50957.64
Organism:Mus musculus (Mouse)
Description:P61168
Residue:444
BDBM11638
NameBDBM11638
Synonyms:CHEMBL26 N-[(1-ethylpyrrolidin-2-yl)methyl]-2-methoxy-5-sulfamoylbenzamide SULPIRIDE,(-) Sulpiride, SLP US10172837, Sulpiride
TypeSmall organic molecule
Emp. Form.C15H23N3O4S
Mol. Mass.341.426
SMILESCCN1CCCC1CNC(=O)c1cc(ccc1OC)S(N)(=O)=O