Reaction Details
TargetP2Y purinoceptor 2
LigandBDBM50006730
Substrate/Competitorn/a
Ki 35.9±n/a nM
CommentsPDSP_1618
Citation Klotz, KNVogt, HTawfik-Schlieper, H Comparison of A1 adenosine receptors in brain from different species by radioligand binding and photoaffinity labelling. Naunyn Schmiedebergs Arch Pharmacol343:196-201 (1991) 
 
P2Y purinoceptor 2
Name:P2Y purinoceptor 2
Type:Enzyme Catalytic Domain
Mol. Mass.:18813.49
Organism:HAMSTER
Description:ADENOSINE A1 ADORA1 HAMSTER::P58825
Residue:166
BDBM50006730
NameBDBM50006730
Synonyms:(R)-2-Hydroxymethyl-5-[6-(1-methyl-2-phenyl-ethylamino)-purin-9-yl]-tetrahydro-furan-3,4-diol (S)-2-Hydroxymethyl-5-[6-(1-methyl-2-phenyl-ethylamino)-purin-9-yl]-tetrahydro-furan-3,4-diol 2-Hydroxymethyl-5-[6-(1-methyl-2-phenyl-ethylamino)-purin-9-yl]-tetrahydro-furan-3,4-diol ChEMBL_20163 L-2-Hydroxymethyl-5-[6-(1-methyl-2-phenyl-ethylamino)-purin-9-yl]-tetrahydro-furan-3,4-diol R-PIA | S-PIA
TypeSmall organic molecule
Emp. Form.C19H23N5O4
Mol. Mass.385.417
SMILESCC(Cc1ccccc1)Nc1ncnc2n(cnc12)C1OC(CO)C(O)C1O