Reaction Details
TargetPlatelet-activating factor receptor
LigandBDBM50011875
Substrate/Competitorn/a
Ki 80.5±n/a nM
CommentsPDSP_430
Citation Tahraoui, LFloch, ACavero, I Functional validation of platelet-activating factor receptor sites characterized biochemically by a specific and reproducible [3H]platelet-activating factor binding in human platelets. J Pharmacol Exp Ther252:1221-7 (1990) Platelet-activating factor receptor
Name:Platelet-activating factor receptor
Type:Enzyme Catalytic Domain
Mol. Mass.:39219.60
Organism:Homo sapiens (Human)
Description:PAF Platelet activating factor PTAFR HUMAN::P25105
Residue:342
BDBM50011875
NameBDBM50011875
Synonyms:2-Bromo-4-(2-chloro-phenyl)-9-methyl-6H-1-thia-5,7,8,9a-tetraaza-cyclopenta[e]azulene CHEMBL32479
TypeSmall organic molecule
Emp. Form.C15H10BrClN4S
Mol. Mass.393.689
SMILESCc1nnc2CN=C(c3cc(Br)sc3-n12)c1ccccc1Cl