Reaction Details
TargetPlatelet-activating factor receptor
LigandBDBM81930
Substrate/Competitorn/a
Ki 16.9±n/a nM
CommentsPDSP_1605
Citation Tahraoui, LFloch, ACavero, I Functional validation of platelet-activating factor receptor sites characterized biochemically by a specific and reproducible [3H]platelet-activating factor binding in human platelets. J Pharmacol Exp Ther252:1221-7 (1990) Platelet-activating factor receptor
Name:Platelet-activating factor receptor
Type:Enzyme Catalytic Domain
Mol. Mass.:39219.60
Organism:Homo sapiens (Human)
Description:PAF Platelet activating factor PTAFR HUMAN::P25105
Residue:342
BDBM81930
NameBDBM81930
Synonyms:CAS_129364 RO 19-3704
TypeSmall organic molecule
Emp. Form.C31H57N2O6S
Mol. Mass.585.859
(=O)OCC(COCCCC[n+]1ccsc1)OC(=O)OC