Reaction Details
TargetKappa-type opioid receptor
LigandBDBM81931
Substrate/Competitorn/a
Ki 0.2±n/a nM
CommentsPDSP_463
Citation Benyhe, SVarga, EHepp, JMagyar, ABorsodi, AWollemann, M Characterization of kappa 1 and kappa 2 opioid binding sites in frog (Rana esculenta) brain membrane preparation. Neurochem Res15:899-904 (1990) 
 
Kappa-type opioid receptor
Name:Kappa-type opioid receptor
Type:G Protein-Coupled Receptor (GPCR)
Mol. Mass.:42692.90
Organism:Rattus norvegicus (rat)
Description:P34975
Residue:380
BDBM81931
NameBDBM81931
Synonyms:CAM N-cyclopropylmethylnorazidomorphine
TypeSmall organic molecule
Emp. Form.C20H24N4O2
Mol. Mass.352.4302
SMILESOc1ccc2C[C@@H]3[C@@H]4CC[C@@H](N=[N+]=[N-])[C@H]5Oc1c2[C@]45CCN3CC1CC1