Reaction Details
Targetkappa-type opioid receptor isoform 1
LigandBDBM81935
Substrate/Competitorn/a
Ki 0.4±n/a nM
CommentsPDSP_1351
Citation Benyhe, SVarga, EHepp, JMagyar, ABorsodi, AWollemann, M Characterization of kappa 1 and kappa 2 opioid binding sites in frog (Rana esculenta) brain membrane preparation. Neurochem Res15:899-904 (1990) 
 
kappa-type opioid receptor isoform 1
Name:kappa-type opioid receptor isoform 1
Type:Enzyme Catalytic Domain
Mol. Mass.:42362.28
Organism:Frog
Description:F7A0F2
Residue:375
BDBM81935
NameBDBM81935
Synonyms:CAS_105618-26-6 Nor-BNI
TypeSmall organic molecule
Emp. Form.C40H43N3O6
Mol. Mass.661.7859
SMILESOc1ccc2CC(C3CC3)N3CCC45C(Oc1c24)c1[nH]c2C4Oc6c7c(CC(C8CC8)N8CCC47C(O)(C8)Cc2c1CC5(O)C3)ccc6O