Reaction Details
TargetHrh3 protein
LigandBDBM22883
Substrate/Competitorn/a
Ki 440±n/a nM
CommentsPDSP_671
Citation West, REZweig, AGranzow, RTSiegel, MIEgan, RW Biexponential kinetics of (R)-alpha-[3H]methylhistamine binding to the rat brain H3 histamine receptor. J Neurochem55:1612-6 (1990) 
 
Hrh3 protein
Name:Hrh3 protein
Type:Enzyme Catalytic Domain
Mol. Mass.:37860.96
Organism:RAT
Description:Q5PPG3
Residue:344
BDBM22883
NameBDBM22883
Synonyms:CHEMBL12344 [3-(carbamimidoylsulfanyl)propyl]dimethylamine
TypeSmall organic molecule
Emp. Form.C6H15N3S
Mol. Mass.161.268
SMILESCN(C)CCCSC(N)=N