Reaction Details
TargetHrh3 protein
LigandBDBM22884
Substrate/Competitorn/a
Ki 46±n/a nM
CommentsPDSP_975
Citation West, REZweig, AGranzow, RTSiegel, MIEgan, RW Biexponential kinetics of (R)-alpha-[3H]methylhistamine binding to the rat brain H3 histamine receptor. J Neurochem55:1612-6 (1990) 
 
Hrh3 protein
Name:Hrh3 protein
Type:Enzyme Catalytic Domain
Mol. Mass.:37860.96
Organism:RAT
Description:Q5PPG3
Residue:344
BDBM22884
NameBDBM22884
Synonyms:2-[3-(1H-imidazol-5-yl)propyl]-1-(2-{[(5-methyl-1H-imidazol-4-yl)methyl]sulfanyl}ethyl)guanidine Impromidine
TypeSmall organic molecule
Emp. Form.C14H23N7S
Mol. Mass.321.444
SMILESCc1nc[nH]c1CSCCN=C(N)NCCCc1cnc[nH]1