Reaction Details
TargetHrh3 protein
LigandBDBM22567
Substrate/Competitorn/a
Ki>10000±n/a nM
CommentsPDSP_1554
Citation West, REZweig, AGranzow, RTSiegel, MIEgan, RW Biexponential kinetics of (R)-alpha-[3H]methylhistamine binding to the rat brain H3 histamine receptor. J Neurochem55:1612-6 (1990) 
 
Hrh3 protein
Name:Hrh3 protein
Type:Enzyme Catalytic Domain
Mol. Mass.:37860.96
Organism:RAT
Description:Q5PPG3
Residue:344
BDBM22567
NameBDBM22567
Synonyms:3H]pyrilamine Dorantamin N-(4-methoxybenzyl)-N ,N -dimethyl-N-pyridin-2-ylethane-1,2-diamine PYRILAMINE [3H]mepyramine | [3H]pyrilamine
Typeradiolabeled ligand
Emp. Form.C17H23N3O
Mol. Mass.285.384
SMILESCOc1ccc(CN(CCN(C)C)c2ccccn2)cc1