Reaction Details
TargetVoltage-dependent L-type calcium channel subunit alpha-1C
LigandBDBM50336640
Substrate/Competitorn/a
Ki>10000±n/a nM
CommentsPDSP_1318
Citation Zobrist, RHMecca, TE [3H]TA-3090, a selective benzothiazepine-type calcium channel receptor antagonist: in vitro characterization. J Pharmacol Exp Ther253:461-5 (1990) Voltage-dependent L-type calcium channel subunit alpha-1C
Name:Voltage-dependent L-type calcium channel subunit alpha-1C
Type:Enzyme Catalytic Domain
Mol. Mass.:243492.26
Organism:RAT
Description:Calcium channel 0 RAT::P22002
Residue:2169
BDBM50336640
NameBDBM50336640
Synonyms:(nifedipine) 2,6-Dimethyl-4-(2-nitro-phenyl)-1,4-dihydro-pyridine-3,5-dicarboxylic acid dimethyl ester Adalat Afeditab cr NIFEDIPINE Procardia dimethyl 2,6-dimethyl-4-(2-nitrophenyl)-1,4-dihydropyridine-3,5-dicarboxylate
TypeSmall organic molecule
Emp. Form.C17H18N2O6
Mol. Mass.346.3346
SMILESCOC(=O)C1C(C(C(=O)OC)=C(C)N=C1C)c1ccccc1[N+]([O-])=O