Reaction Details
TargetMuscarinic acetylcholine receptor M4
LigandBDBM81799
Substrate/Competitorn/a
Ki 110±n/a nM
CommentsPDSP_932
Citation Waelbroeck, MTastenoy, MCamus, JChristophe, J Binding of selective antagonists to four muscarinic receptors (M1 to M4) in rat forebrain. Mol Pharmacol38:267-73 (1990) Muscarinic acetylcholine receptor M4
Name:Muscarinic acetylcholine receptor M4
Type:Enzyme Catalytic Domain
Mol. Mass.:52841.70
Organism:RAT
Description:Cholinergic, muscarinic M4 CHRM4 RAT::P08485
Residue:477
BDBM81799
NameBDBM81799
Synonyms:CAS_98299-40-2 NSC_3602 | hexahydrosiladifenidol
TypeSmall organic molecule
Emp. Form.C20H33NOSi
Mol. Mass.331.5676
SMILESO[Si](CCCN1CCCCC1)(C1CCCCC1)c1ccccc1