Reaction Details
TargetD(1A) dopamine receptor
LigandBDBM50026957
Substrate/Competitorn/a
Ki 0.32±n/a nM
CommentsPDSP_268
Citation Andersen, PHGrønvald, FCJansen, JA A comparison between dopamine-stimulated adenylate cyclase and 3H-SCH 23390 binding in rat striatum. Life Sci37:1971-83 (1985) 
 
D(1A) dopamine receptor
Name:D(1A) dopamine receptor
Type:Enzyme Catalytic Domain
Mol. Mass.:49429.75
Organism:RAT
Description:P18901
Residue:446
BDBM50026957
NameBDBM50026957
Synonyms:(cis) 2-{4-[3-(2-Trifluoromethyl-thioxanthen-9-ylidene)-propyl]-piperazin-1-yl}-ethanol(Flupentixol) 2-(4-{3-[2-Trifluoromethyl-thioxanthen-(9E)-ylidene]-propyl}-piperazin-1-yl)-ethanol FLUPENTHIXOL, Alpha Flupenthixol | Flupenthixol, Beta
TypeSmall organic molecule
Emp. Form.C23H25F3N2OS
Mol. Mass.434.518
SMILESOCCN1CCN(CC\C=C2/c3ccccc3Sc3ccc(cc23)C(F)(F)F)CC1