Reaction Details
TargetD(2) dopamine receptor
LigandBDBM50130273
Substrate/Competitorn/a
Ki 0.95±n/a nM
CommentsPDSP_1456
Citation Andersen, PHGrønvald, FCJansen, JA A comparison between dopamine-stimulated adenylate cyclase and 3H-SCH 23390 binding in rat striatum. Life Sci37:1971-83 (1985) 
 
D(2) dopamine receptor
Name:D(2) dopamine receptor
Type:G Protein-Coupled Receptor (GPCR)
Mol. Mass.:50931.60
Organism:Rattus norvegicus (rat)
Description:P61169
Residue:444
BDBM50130273
NameBDBM50130273
Synonyms:2-(4-[3-(2-chloro-10H-phenothiazin-10-yl)propyl]-1-piperazinyl)ethanol 2-{4-[3-(2-chloro-10H-phenothiazin-10-yl)propyl]piperazin-1-yl}ethanol 4-[3-(2-chlorophenothiazin-10-yl)propyl]-1-piperazineethanol Chlorpiprazine Perfenazine Trilafon | gamma-(4-(beta-hydroxyethyl)piperazin-1-yl)propyl-2-chlorophenothiazine
TypeSmall organic molecule
Emp. Form.C21H26ClN3OS
Mol. Mass.403.969
SMILESOCCN1CCN(CCCN2c3ccccc3Sc3ccc(Cl)cc23)CC1