Reaction Details
TargetProtachykinin-1
LigandBDBM50001450
Substrate/Competitorn/a
Ki 112±n/a nM
CommentsPDSP_1775
Citation Burcher, EBuck, SHLovenberg, WO'Donohue, TL Characterization and autoradiographic localization of multiple tachykinin binding sites in gastrointestinal tract and bladder. J Pharmacol Exp Ther236:819-31 (1986) Protachykinin-1
Name:Protachykinin-1
Type:Enzyme Catalytic Domain
Mol. Mass.:15007.06
Organism:RAT
Description:Substance K 0 RAT::P06767
Residue:130
BDBM50001450
NameBDBM50001450
Synonyms:(SP)Arg-Pro-Lys-Pro-Gln-Gln-Phe-Phe-Gly-Leu-Met-NH2 Arg-Pro-Lys-Pro-Gln-Gln-Phe-Phe-Gly-Leu-Met-NH2 Arg-Pro-Lys-Pro-Gln-Gln-Phe-Phe-Gly-Leu-Met-NH2.(Substance P) ArgProLysProGlnGlnPhePheGlyLeuMet H-Arg-Pro-Lys-Pro-Gln-Gln-Phe-D-Phe-Gly-Leu-Met-NH2 Substance P Substance P analogue | tachykinin substance P (SP)
TypeSmall organic molecule
Emp. Form.C63H98N18O13S
Mol. Mass.1347.63
SMILES[#6]-[#16]-[#6]-[#6]-[#6@H](-[#7]-[#6](=O)-[#6@H](-[#6]-[#6](-[#6])-[#6])-[#7]-[#6](=O)-[#6]-[#7]-[#6](=O)-[#6@H](-[#6]-c1ccccc1)-[#7]-[#6](=O)-[#6@H](-[#6]-c1ccccc1)-[#7]-[#6](=O)-[#6@H](-[#6]-[#6]-[#6](-[#7])=O)-[#7]-[#6](=O)-[#6@H](-[#6]-[#6]-[#6](-[#7])=O)-[#7]-[#6](=O)-[#6@@H]-1-[#6]-[#6]-[#6]-[#7]-1-[#6](=O)-[#6@H](-[#6]-[#6]-[#6]-[#6]-[#7])-[#7]-[#6](=O)-[#6@@H]-1-[#6]-[#6]-[#6]-[#7]-1-[#6](=O)-[#6@@H](-[#7])-[#6]-[#6]-[#6]\[#7]=[#6](\[#7])-[#7])-[#6](-[#7])=O