Reaction Details
TargetSodium-dependent serotonin transporter
LigandBDBM35234
Substrate/Competitorn/a
Ki 1000±n/a nM
CommentsPDSP_1348
Citation Andersen, PH The dopamine inhibitor GBR 12909: selectivity and molecular mechanism of action. Eur J Pharmacol166:493-504 (1989) 
 
Sodium-dependent serotonin transporter
Name:Sodium-dependent serotonin transporter
Type:Multi-pass membrane protein
Mol. Mass.:70168.43
Organism:Rattus norvegicus (rat)
Description:P31652
Residue:630
BDBM35234
NameBDBM35234
Synonyms:DL-[7-3H]norepinephrine Noradrenaline,(+) | [3H]NE
Typeradiolabeled ligand
Emp. Form.C8H11NO3
Mol. Mass.169.1778
SMILESNCC(O)c1ccc(O)c(O)c1