Reaction Details
TargetSodium-dependent dopamine transporter
LigandBDBM22165
Substrate/Competitorn/a
Ki 1±n/a nM
CommentsPDSP_870
Citation Andersen, PH The dopamine inhibitor GBR 12909: selectivity and molecular mechanism of action. Eur J Pharmacol166:493-504 (1989) 
 
Sodium-dependent dopamine transporter
Name:Sodium-dependent dopamine transporter
Type:Multi-pass membrane protein
Mol. Mass.:68749.45
Organism:Rattus norvegicus (rat)
Description:P23977
Residue:619
BDBM22165
NameBDBM22165
Synonyms:1-{2-[bis(4-fluorophenyl)methoxy]ethyl}-4-(3-phenylpropyl)piperazine CHEMBL281594 CHEMBL543876 GBR-12909 US9944618, Compound ID No. 175 | Vanoxerine
TypeSmall organic molecule
Emp. Form.C28H32F2N2O
Mol. Mass.450.5633
SMILESFc1ccc(cc1)C(OCCN1CCN(CCCc2ccccc2)CC1)c1ccc(F)cc1