Reaction Details
TargetNorepinephrine transporter
LigandBDBM50005548
Substrate/Competitorn/a
Ki 11.2±n/a nM
CommentsPDSP_1347
Citation Andersen, PH The dopamine inhibitor GBR 12909: selectivity and molecular mechanism of action. Eur J Pharmacol166:493-504 (1989) 
 
Norepinephrine transporter
Name:Norepinephrine transporter
Synonyms:n/a
Type:Enzyme Catalytic Domain
Mol. Mass.:2082.45
Organism:RAT
Description:Norepinephrine transporter 0 RAT::Q9JIA2
Residue:19
MLLARMKPQVQPELGGADQ
BDBM50005548
NameBDBM50005548
TypeSmall organic molecule
Emp. Form.C16H18N2
Mol. Mass.238.3275
SMILESCN1CC(c2ccccc2)c2cccc(N)c2C1