Reaction Details
TargetD(1A) dopamine receptor
LigandBDBM81950
Substrate/Competitorn/a
Ki 1883±n/a nM
CommentsPDSP_3871
Citation Sánchez-Roa, PMGrigoriadis, DEWilson, AASharkey, JDannals, RFVillemagne, VLWong, DFWagner, HNKuhar, MJ [125]I-spectramide: a novel benzamide displaying potent and selective effects at the D2 dopamine receptor. Life Sci45:1821-9 (1989) 
 
D(1A) dopamine receptor
Name:D(1A) dopamine receptor
Type:Enzyme Catalytic Domain
Mol. Mass.:49429.75
Organism:RAT
Description:P18901
Residue:446
BDBM81950
NameBDBM81950
Synonyms:CAS_130377 Spectramide
TypeSmall organic molecule
Emp. Form.C19H23ClIN3O2
Mol. Mass.487.762
SMILESCNc1cc(OC)c(cc1Cl)C(=O)NCCN(C)Cc1ccc(I)cc1