Reaction Details
TargetMu-type opioid receptor
LigandBDBM21865
Substrate/Competitorn/a
Ki>10000±n/a nM
CommentsPDSP_676
Citation Sánchez-Roa, PMGrigoriadis, DEWilson, AASharkey, JDannals, RFVillemagne, VLWong, DFWagner, HNKuhar, MJ [125]I-spectramide: a novel benzamide displaying potent and selective effects at the D2 dopamine receptor. Life Sci45:1821-9 (1989) 
 
Mu-type opioid receptor
Name:Mu-type opioid receptor
Type:G Protein-Coupled Receptor (GPCR)
Mol. Mass.:44503.11
Organism:Rattus norvegicus (rat)
Description:Competition binding assays were carried out using membrane preparations from transfected HN9.10 cells that constitutively expressed the mu opioid receptor.
Residue:398
BDBM21865
NameBDBM21865
Synonyms:(14beta)-17-(cyclopropylmethyl)-18-(1-hydroxy-1-methylethyl)-6-methoxy-18,19-dihydro-4,5-epoxy-6,14-ethenomorphinan-3-ol CHEMBL24995 [3H]-diprenorphine
Typeradiolabeled ligand
Emp. Form.C26H35NO4
Mol. Mass.425.5604
SMILES[H][C@]12Cc3ccc(O)c4OC5[C@](CCN1CC1CC1)(c34)[C@@]21CCC5(OC)C(C1)C(C)(C)O