Reaction Details
TargetD(2) dopamine receptor
LigandBDBM82247
Substrate/Competitorn/a
Ki 3300±n/a nM
CommentsPDSP_1685
Citation Grandy, DKMarchionni, MAMakam, HStofko, REAlfano, MFrothingham, LFischer, JBBurke-Howie, KJBunzow, JRServer, AC Cloning of the cDNA and gene for a human D2 dopamine receptor. Proc Natl Acad Sci U S A86:9762-6 (1989) 
 
D(2) dopamine receptor
Name:D(2) dopamine receptor
Type:G Protein-Coupled Receptor (GPCR)
Mol. Mass.:50931.60
Organism:Rattus norvegicus (rat)
Description:P61169
Residue:444
BDBM82247
NameBDBM82247
Synonyms:8-Chloro-3-methyl-5-phenyl-2,3,4,5-tetrahydro-1H-benzo[d]azepin-7-ol(SCH 23390) CHEMBL2158641 SCH 23388 SCH 23390 (R-enantiomer) | SCH 23390,R(+)
TypeSmall organic molecule
Emp. Form.C17H18ClNO
Mol. Mass.287.784
SMILESCN1CCc2cc(Cl)c(O)cc2[C@H](C1)c1ccccc1