Reaction Details
TargetGamma-aminobutyric acid receptor subunit alpha-1
LigandBDBM26263
Substrate/Competitorn/a
Ki 0.49±n/a nM
CommentsPDSP_1609
Citation Pritchett, DBLüddens, HSeeburg, PH Type I and type II GABAA-benzodiazepine receptors produced in transfected cells. Science245:1389-92 (1989) 
 
Gamma-aminobutyric acid receptor subunit alpha-1
Name:Gamma-aminobutyric acid receptor subunit alpha-1
Type:Protein
Mol. Mass.:51817.35
Organism:Homo sapiens (Human)
Description:P14867
Residue:456
BDBM26263
NameBDBM26263
Synonyms:Anexate FLUMAZENIL Romazicon ethyl 12-fluoro-8-methyl-9-oxo-2,4,8-triazatricyclo[8.4.0.0^{2,6}]tetradeca-1(14),3,5,10,12-pentaene-5-carboxylate
TypeSmall organic molecule
Emp. Form.C15H14FN3O3
Mol. Mass.303.2884
SMILESCCOC(=O)c1ncn-2c1CN(C)C(=O)c1cc(F)ccc-21