Reaction Details
TargetGamma-aminobutyric acid receptor subunit alpha-3
LigandBDBM50019213
Substrate/Competitorn/a
Ki 2±n/a nM
CommentsPDSP_543
Citation Pritchett, DBLüddens, HSeeburg, PH Type I and type II GABAA-benzodiazepine receptors produced in transfected cells. Science245:1389-92 (1989) 
 
Gamma-aminobutyric acid receptor subunit alpha-3
Name:Gamma-aminobutyric acid receptor subunit alpha-3
Type:Enzyme Catalytic Domain
Mol. Mass.:55175.47
Organism:Homo sapiens (Human)
Description:GABA A Alpha3Beta1Gamma2 0 HUMAN::P34903
Residue:492
BDBM50019213
NameBDBM50019213
Synonyms:1,3-dihydro-7-nitro-5-(2-chlorophenyl)-2H-1,4.benzodiazepin-2-one 5-(o-chlorophenyl)-7-nitro-1,3-dihydro-2H-1,4-benzodiazepin-2-one CLONAZEPAM
TypeSmall organic molecule
Emp. Form.C15H10ClN3O3
Mol. Mass.315.711
SMILES[O-][N+](=O)c1ccc2NC(=O)CN=C(c3ccccc3Cl)c2c1