Reaction Details
TargetGamma-aminobutyric acid receptor subunit alpha-3
LigandBDBM50000766
Substrate/Competitorn/a
Ki 17±n/a nM
CommentsPDSP_656
Citation Pritchett, DBLüddens, HSeeburg, PH Type I and type II GABAA-benzodiazepine receptors produced in transfected cells. Science245:1389-92 (1989) 
 
Gamma-aminobutyric acid receptor subunit alpha-3
Name:Gamma-aminobutyric acid receptor subunit alpha-3
Type:Enzyme Catalytic Domain
Mol. Mass.:55175.47
Organism:Homo sapiens (Human)
Description:GABA A Alpha3Beta1Gamma2 0 HUMAN::P34903
Residue:492
BDBM50000766
NameBDBM50000766
Synonyms:CHEMBL12 US9271961, Diazepam
TypeSmall organic molecule
Emp. Form.C16H13ClN2O
Mol. Mass.284.74
SMILESCN1c2ccc(Cl)cc2C(=NCC1=O)c1ccccc1