Reaction Details
Target5-hydroxytryptamine receptor 2A
LigandBDBM81946
Substrate/Competitorn/a
Ki 290±n/a nM
CommentsPDSP_1121
Citation Hyttel, JLarsen, JJ Neurochemical profile of Lu 19-005, a potent inhibitor of uptake of dopamine, noradrenaline, and serotonin. J Neurochem44:1615-22 (1985) 
 
5-hydroxytryptamine receptor 2A
Name:5-hydroxytryptamine receptor 2A
Type:G Protein-Coupled Receptor (GPCR)
Mol. Mass.:52852.05
Organism:Rattus norvegicus (rat)
Description:Rat cortex membranes 5-HT2A receptors.
Residue:471
BDBM81946
NameBDBM81946
Synonyms:CAS_96850-13-4 LU 19-005
TypeSmall organic molecule
Emp. Form.C16H15Cl2N
Mol. Mass.292.203
SMILESCN[C@H]1C[C@@H](c2ccccc12)c1ccc(Cl)c(Cl)c1