Reaction Details
TargetAlpha-1A adrenergic receptor
LigandBDBM50021217
Substrate/Competitorn/a
Ki>10000±n/a nM
CommentsPDSP_3888
Citation Hyttel, JLarsen, JJ Neurochemical profile of Lu 19-005, a potent inhibitor of uptake of dopamine, noradrenaline, and serotonin. J Neurochem44:1615-22 (1985) 
 
Alpha-1A adrenergic receptor
Name:Alpha-1A adrenergic receptor
Type:Protein
Mol. Mass.:51620.15
Organism:Rattus norvegicus (Rat)
Description:P43140
Residue:466
BDBM50021217
NameBDBM50021217
Synonyms:CHEMBL52247 [3-(3,3-Dimethyl-1-phenyl-1,3-dihydro-benzo[c]thiophen-1-yl)-propyl]-methyl-amine(Talsupram)
TypeSmall organic molecule
Emp. Form.C20H25NS
Mol. Mass.311.484
SMILESCNCCCC1(SC(C)(C)c2ccccc12)c1ccccc1