Reaction Details
TargetNorepinephrine transporter
LigandBDBM50021217
Substrate/Competitorn/a
Ki 0.79±n/a nM
CommentsPDSP_3888
Citation Hyttel, JLarsen, JJ Neurochemical profile of Lu 19-005, a potent inhibitor of uptake of dopamine, noradrenaline, and serotonin. J Neurochem44:1615-22 (1985) 
 
Norepinephrine transporter
Name:Norepinephrine transporter
Synonyms:n/a
Type:Enzyme Catalytic Domain
Mol. Mass.:2082.45
Organism:RAT
Description:Norepinephrine transporter 0 RAT::Q9JIA2
Residue:19
MLLARMKPQVQPELGGADQ
BDBM50021217
NameBDBM50021217
TypeSmall organic molecule
Emp. Form.C20H25NS
Mol. Mass.311.484
SMILESCNCCCC1(SC(C)(C)c2ccccc12)c1ccccc1