Reaction Details
Target5-hydroxytryptamine receptor 3A
LigandBDBM50001915
Substrate/Competitorn/a
Ki 20±n/a nM
CommentsPDSP_1168
Citation Glennon, RAIsmaiel, AEMcCarthy, BGPeroutka, SJ Binding of arylpiperazines to 5-HT3 serotonin receptors: results of a structure-affinity study. Eur J Pharmacol168:387-92 (1989) 
 
5-hydroxytryptamine receptor 3A
Name:5-hydroxytryptamine receptor 3A
Type:Enzyme Catalytic Domain
Mol. Mass.:55428.70
Organism:RAT
Description:5-HT3 HTR3A RAT::P35563
Residue:483
BDBM50001915
NameBDBM50001915
Synonyms:1-(3-chlorophenyl)piperazine m-Chlorophenylpiperazine | mCPP
TypeSmall organic molecule
Emp. Form.C10H13ClN2
Mol. Mass.196.677
SMILESClc1cccc(c1)N1CCNCC1