Reaction Details
TargetMuscarinic acetylcholine receptor M1
LigandBDBM81961
Substrate/Competitorn/a
Ki 2±n/a nM
CommentsPDSP_1712
Citation Buckley, NJBonner, TIBuckley, CMBrann, MR Antagonist binding properties of five cloned muscarinic receptors expressed in CHO-K1 cells. Mol Pharmacol35:469-76 (1989) Muscarinic acetylcholine receptor M1
Name:Muscarinic acetylcholine receptor M1
Type:Enzyme Catalytic Domain
Mol. Mass.:51390.46
Organism:RAT
Description:P08482
Residue:460
BDBM81961
NameBDBM81961
Synonyms:CAS_124393-85-7 silahexocyclium
TypeSmall organic molecule
Emp. Form.C19H33N2OSi
Mol. Mass.333.5631
SMILESC[N+]1([SiH3])CCN(CC(O)(C2CCCCC2)c2ccccc2)CC1