Reaction Details
TargetMuscarinic acetylcholine receptor M2
LigandBDBM81799
Substrate/Competitorn/a
Ki 249±n/a nM
CommentsPDSP_931
Citation Buckley, NJBonner, TIBuckley, CMBrann, MR Antagonist binding properties of five cloned muscarinic receptors expressed in CHO-K1 cells. Mol Pharmacol35:469-76 (1989) Muscarinic acetylcholine receptor M2
Name:Muscarinic acetylcholine receptor M2
Type:GPCR
Mol. Mass.:51730.61
Organism:Homo sapiens (Human)
Description:P08172
Residue:466
BDBM81799
NameBDBM81799
Synonyms:CAS_98299-40-2 NSC_3602 | hexahydrosiladifenidol
TypeSmall organic molecule
Emp. Form.C20H33NOSi
Mol. Mass.331.5676
SMILESO[Si](CCCN1CCCCC1)(C1CCCCC1)c1ccccc1