Reaction Details
TargetMuscarinic acetylcholine receptor M4
LigandBDBM81961
Substrate/Competitorn/a
Ki 3.2±n/a nM
CommentsPDSP_1712
Citation Buckley, NJBonner, TIBuckley, CMBrann, MR Antagonist binding properties of five cloned muscarinic receptors expressed in CHO-K1 cells. Mol Pharmacol35:469-76 (1989) Muscarinic acetylcholine receptor M4
Name:Muscarinic acetylcholine receptor M4
Type:Enzyme Catalytic Domain
Mol. Mass.:53079.31
Organism:Homo sapiens (Human)
Description:Cholinergic, muscarinic M4 CHRM4 HUMAN M3::P08173
Residue:479
BDBM81961
NameBDBM81961
Synonyms:CAS_124393-85-7 silahexocyclium
TypeSmall organic molecule
Emp. Form.C19H33N2OSi
Mol. Mass.333.5631
SMILESC[N+]1([SiH3])CCN(CC(O)(C2CCCCC2)c2ccccc2)CC1