Reaction Details
TargetCholecystokinin
LigandBDBM81964
Substrate/Competitorn/a
Ki 560±n/a nM
CommentsPDSP_2215
Citation Lotti, VJChang, RS A new potent and selective non-peptide gastrin antagonist and brain cholecystokinin receptor (CCK-B) ligand: L-365,260. Eur J Pharmacol162:273-80 (1989) 
 
Cholecystokinin
Name:Cholecystokinin
Type:Enzyme Catalytic Domain
Mol. Mass.:12528.64
Organism:GUINEA PIG
Description:Cholecystokinin B 0 GUINEA PIG::P01356
Residue:114
BDBM81964
NameBDBM81964
Synonyms:CAS_5486814 NSC_5486814 | Neuromedin C
TypeSmall organic molecule
Emp. Form.C50H73N17O11S
Mol. Mass.1120.287
SMILESCSCCC(NC(=O)C(CC(C)C)NC(=O)C(Cc1cnc[nH]1)NC(=O)CNC(=O)C(NC(=O)C(C)NC(=O)C(Cc1c[nH]c2ccccc12)NC(=O)C(Cc1cnc[nH]1)NC(=O)C(CC(N)=O)NC(=O)CN)C(C)C)C(N)=O