Reaction Details
TargetGastrin/cholecystokinin type B receptor
LigandBDBM50061220
Substrate/Competitorn/a
Ki 2.4±n/a nM
CommentsPDSP_2199
Citation Lotti, VJChang, RS A new potent and selective non-peptide gastrin antagonist and brain cholecystokinin receptor (CCK-B) ligand: L-365,260. Eur J Pharmacol162:273-80 (1989) 
 
Gastrin/cholecystokinin type B receptor
Name:Gastrin/cholecystokinin type B receptor
Type:G Protein-Coupled Receptor (GPCR)
Mol. Mass.:48445.79
Organism:Homo sapiens (Human)
Description:Stable expression of human CCK-2 receptors in HEK 293 cells.
Residue:447
BDBM50061220
NameBDBM50061220
Synonyms:1-((S)-1-Methyl-2-oxo-5-phenyl-2,3-dihydro-1H-benzo[e][1,4]diazepin-3-yl)-3-m-tolyl-urea 1-(1-Methyl-2-oxo-5-phenyl-2,3-dihydro-1H-benzo[e][1,4]diazepin-3-yl)-3-m-tolyl-urea((S)L365_260) L-365,260
TypeSmall organic molecule
Emp. Form.C24H22N4O2
Mol. Mass.398.4571
SMILESCN1c2ccccc2C(=N[C@H](NC(=O)Nc2cccc(C)c2)C1=O)c1ccccc1