Reaction Details
TargetAdenosine receptor A1
LigandBDBM50004464
Substrate/Competitorn/a
Ki 910±n/a nM
CommentsPDSP_2892
Citation Hutchison, AJWebb, RLOei, HHGhai, GRZimmerman, MBWilliams, M CGS 21680C, an A2 selective adenosine receptor agonist with preferential hypotensive activity. J Pharmacol Exp Ther251:47-55 (1989) Adenosine receptor A1
Name:Adenosine receptor A1
Type:Protein
Mol. Mass.:36704.13
Organism:Rattus norvegicus (rat)
Description:n/a
Residue:326
BDBM50004464
NameBDBM50004464
Synonyms:(CV 1808) 2-(6-Amino-2-phenylamino-purin-9-yl)-5-hydroxymethyl-tetrahydro-furan-3,4-diol CV 1808 | CV-1808
TypeSmall organic molecule
Emp. Form.C16H18N6O4
Mol. Mass.358.3519
SMILESNc1nc(Nc2ccccc2)nc2n(cnc12)[C@@H]1O[C@H](CO)[C@H](O)C1O