Reaction Details
TargetAdenosine receptor A2a
LigandBDBM50015653
Substrate/Competitorn/a
Ki 12.9±n/a nM
CommentsPDSP_2893
Citation Hutchison, AJWebb, RLOei, HHGhai, GRZimmerman, MBWilliams, M CGS 21680C, an A2 selective adenosine receptor agonist with preferential hypotensive activity. J Pharmacol Exp Ther251:47-55 (1989) Adenosine receptor A2a
Name:Adenosine receptor A2a
Type:G Protein-Coupled Receptor (GPCR)
Mol. Mass.:45015.65
Organism:Rattus norvegicus (rat)
Description:Rat A2A receptors expressed in CHO cells.
Residue:410
BDBM50015653
NameBDBM50015653
Synonyms:(2S,3S,4R)-5-((R)-6-Amino-2-phenethylamino-purin-9-yl)-3,4-dihydroxy-tetrahydro-furan-2-carboxylic acid ethylamide CHEMBL58479
TypeSmall organic molecule
Emp. Form.C20H25N7O4
Mol. Mass.427.457
SMILESCCNC(=O)[C@H]1OC([C@H](O)[C@@H]1O)n1cnc2c(N)nc(NCCc3ccccc3)nc12