Reaction Details
TargetAdenosine receptor A2a
LigandBDBM81970
Substrate/Competitorn/a
Ki 870±n/a nM
CommentsPDSP_506
Citation Hutchison, AJWebb, RLOei, HHGhai, GRZimmerman, MBWilliams, M CGS 21680C, an A2 selective adenosine receptor agonist with preferential hypotensive activity. J Pharmacol Exp Ther251:47-55 (1989) Adenosine receptor A2a
Name:Adenosine receptor A2a
Type:G Protein-Coupled Receptor (GPCR)
Mol. Mass.:45015.65
Organism:Rattus norvegicus (rat)
Description:Rat A2A receptors expressed in CHO cells.
Residue:410
BDBM81970
NameBDBM81970
Synonyms:CAS_108-91-8 Cyclohexylamines
TypeSmall organic molecule
Emp. Form.C6H13N
Mol. Mass.99.1741
SMILESNC1CCCCC1