Reaction Details
TargetHrh3 protein
LigandBDBM81972
Substrate/Competitorn/a
Ki 11±n/a nM
CommentsPDSP_271
Citation Arrang, JMGarbarg, MLancelot, JCLecomte, JMPollard, HRobba, MSchunack, WSchwartz, JC Highly potent and selective ligands for a new class H3 of histamine receptor. Invest Radiol0:0-2 (1988) 
 
Hrh3 protein
Name:Hrh3 protein
Type:Enzyme Catalytic Domain
Mol. Mass.:37860.96
Organism:RAT
Description:Q5PPG3
Residue:344
BDBM81972
NameBDBM81972
Synonyms:(S)-(+)-ALPHA-METHYL-1H-IMIDAZOLE-4-ETHANAMINE DIHYDROBROMIDE CAS_75614-93-6
TypeSmall organic molecule
Emp. Form.C6H11N3
Mol. Mass.125.1716
SMILESC[C@H](N)Cc1cnc[nH]1