Reaction Details
TargetGlutamate receptor ionotropic, NMDA 1
LigandBDBM50002360
Substrate/Competitorn/a
Ki 220±n/a nM
CommentsPDSP_585
Citation Murphy, DEHutchison, AJHurt, SDWilliams, MSills, MA Characterization of the binding of [3H]-CGS 19755: a novel N-methyl-D-aspartate antagonist with nanomolar affinity in rat brain. Br J Pharmacol95:932-8 (1988) 
 
Glutamate receptor ionotropic, NMDA 1
Name:Glutamate receptor ionotropic, NMDA 1
Type:Enzyme Catalytic Domain
Mol. Mass.:105533.40
Organism:RAT
Description:P35439
Residue:938
BDBM50002360
NameBDBM50002360
Synonyms:(CPP)4-(3-Phosphono-propyl)-piperazine-2-carboxylic acid 4-(3-Phosphono-propyl)-piperazine-2-carboxylic acid CHEMBL22304 | CPP
TypeSmall organic molecule
Emp. Form.C8H17N2O5P
Mol. Mass.252.2047
SMILESOC(=O)C1CN(CCCP(O)(O)=O)CCN1