Reaction Details
TargetGlutamate receptor ionotropic, NMDA 1
LigandBDBM17657
Substrate/Competitorn/a
Ki 100±n/a nM
CommentsPDSP_1076
Citation Murphy, DEHutchison, AJHurt, SDWilliams, MSills, MA Characterization of the binding of [3H]-CGS 19755: a novel N-methyl-D-aspartate antagonist with nanomolar affinity in rat brain. Br J Pharmacol95:932-8 (1988) 
 
Glutamate receptor ionotropic, NMDA 1
Name:Glutamate receptor ionotropic, NMDA 1
Type:Enzyme Catalytic Domain
Mol. Mass.:105533.40
Organism:RAT
Description:P35439
Residue:938
BDBM17657
NameBDBM17657
Synonyms:(2S)-2-aminopentanedioic acid D-Glutamate L-Glu L-Glutamic acid L-gluatmate
TypeAmino Acid
Emp. Form.C5H9NO4
Mol. Mass.147.1293
SMILESN[C@@H](CCC(O)=O)C(O)=O